Reaction Details
TargetRetinoic acid receptor RXR-beta
LigandBDBM50052962
Substrate/Competitorn/a
Meas. Tech.ChEMBL_197068 (CHEMBL806657)
Kd 87±n/a nM
Citation Beard, RLColon, DFSong, TKDavies, PJKochhar, DMChandraratna, RA Synthesis and structure-activity relationships of retinoid X receptor selective diaryl sulfide analogs of retinoic acid. J Med Chem39:3556-63 (1996) 
 
Retinoic acid receptor RXR-beta
Name:Retinoic acid receptor RXR-beta
Type:PROTEIN
Mol. Mass.:55877.78
Organism:Mus musculus
Description:ChEMBL_196588
Residue:520
BDBM50052962
NameBDBM50052962
Synonyms:6-(3,5,5,8,8-Pentamethyl-5,6,7,8-tetrahydro-naphthalen-2-ylsulfanyl)-nicotinic acid | CHEMBL116886
TypeSmall organic molecule
Emp. Form.C21H25NO2S
Mol. Mass.355.494
SMILESCc1cc2c(cc1Sc1ccc(cn1)C(O)=O)C(C)(C)CCC2(C)C