Reaction Details
TargetRetinoic acid receptor beta
LigandBDBM50052960
Substrate/Competitorn/a
Meas. Tech.ChEMBL_195642 (CHEMBL795960)
Kd 1000±n/a nM
Citation Beard, RLColon, DFSong, TKDavies, PJKochhar, DMChandraratna, RA Synthesis and structure-activity relationships of retinoid X receptor selective diaryl sulfide analogs of retinoic acid. J Med Chem39:3556-63 (1996) 
 
Retinoic acid receptor beta
Name:Retinoic acid receptor beta
Type:PROTEIN
Mol. Mass.:53344.93
Organism:Mus musculus
Description:ChEMBL_195641
Residue:482
BDBM50052960
NameBDBM50052960
Synonyms:2-(3,5,5,8,8-Pentamethyl-5,6,7,8-tetrahydro-naphthalen-2-ylsulfanyl)-thiazole-5-carboxylic acid | CHEMBL118268
TypeSmall organic molecule
Emp. Form.C19H23NO2S2
Mol. Mass.361.521
SMILESCc1cc2c(cc1Sc1ncc(s1)C(O)=O)C(C)(C)CCC2(C)C