Reaction Details
TargetCellular retinoic acid-binding protein 1
LigandBDBM50053093
Substrate/Competitorn/a
Meas. Tech.ChEMBL_52266 (CHEMBL665219)
IC50>10000±n/a nM
Citation Muccio, DDBrouillette, WJAlam, MVaezi, MFSani, BPVenepally, PReddy, LLi, ENorris, AWSimpson-Herren, LHill, DL Conformationally defined 6-s-trans-retinoic acid analogs. 3. Structure-activity relationships for nuclear receptor binding, transcriptional activity, and cancer chemopreventive activity. J Med Chem39:3625-35 (1996) 
 
Cellular retinoic acid-binding protein 1
Name:Cellular retinoic acid-binding protein 1
Type:PROTEIN
Mol. Mass.:15660.02
Organism:Gallus gallus
Description:ChEMBL_52265
Residue:137
BDBM50053093
NameBDBM50053093
Synonyms:(2E,4E,6E)-8-Cyclohex-2-en-(E)-ylidene-3,7-dimethyl-octa-2,4,6-trienoic acid | CHEMBL121659
TypeSmall organic molecule
Emp. Form.C16H20O2
Mol. Mass.244.3288
SMILESC\C(\C=C\C=C(/C)\C=C1/CCCC=C1)=C/C(O)=O