Reaction Details
TargetCellular retinoic acid-binding protein 2
LigandBDBM50407930
Substrate/Competitorn/a
Meas. Tech.ChEMBL_52400 (CHEMBL665904)
Kd>200±n/a nM
Citation Muccio, DDBrouillette, WJAlam, MVaezi, MFSani, BPVenepally, PReddy, LLi, ENorris, AWSimpson-Herren, LHill, DL Conformationally defined 6-s-trans-retinoic acid analogs. 3. Structure-activity relationships for nuclear receptor binding, transcriptional activity, and cancer chemopreventive activity. J Med Chem39:3625-35 (1996) 
 
Cellular retinoic acid-binding protein 2
Name:Cellular retinoic acid-binding protein 2
Type:PROTEIN
Mol. Mass.:15744.92
Organism:Mus musculus
Description:ChEMBL_52402
Residue:138
BDBM50407930
NameBDBM50407930
Synonyms:CHEMBL2111792
TypeSmall organic molecule
Emp. Form.C18H24O2
Mol. Mass.272.382
SMILESC/C(/C=C/C=C(/C)\C=C1/CCCC(C)=C1C)=C\C(O)=O