Reaction Details
TargetCellular retinoic acid-binding protein 1
LigandBDBM50407931
Substrate/Competitorn/a
Meas. Tech.ChEMBL_52398 (CHEMBL665902)
Kd>200±n/a nM
Citation Muccio, DDBrouillette, WJAlam, MVaezi, MFSani, BPVenepally, PReddy, LLi, ENorris, AWSimpson-Herren, LHill, DL Conformationally defined 6-s-trans-retinoic acid analogs. 3. Structure-activity relationships for nuclear receptor binding, transcriptional activity, and cancer chemopreventive activity. J Med Chem39:3625-35 (1996) 
 
Cellular retinoic acid-binding protein 1
Name:Cellular retinoic acid-binding protein 1
Type:PROTEIN
Mol. Mass.:15588.40
Organism:Mus musculus
Description:ChEMBL_52399
Residue:137
BDBM50407931
NameBDBM50407931
Synonyms:CHEMBL2114968
TypeSmall organic molecule
Emp. Form.C21H30O2
Mol. Mass.314.4617
SMILESCCC1=C(C(C)C)\C(CCC1)=C\C(\C)=C/C=C/C(/C)=C/C(O)=O