Reaction Details
TargetRetinoic acid receptor RXR-alpha
LigandBDBM50407929
Substrate/Competitorn/a
Meas. Tech.ChEMBL_196783 (CHEMBL799727)
IC50>2000±n/a nM
Citation Muccio, DDBrouillette, WJAlam, MVaezi, MFSani, BPVenepally, PReddy, LLi, ENorris, AWSimpson-Herren, LHill, DL Conformationally defined 6-s-trans-retinoic acid analogs. 3. Structure-activity relationships for nuclear receptor binding, transcriptional activity, and cancer chemopreventive activity. J Med Chem39:3625-35 (1996) 
 
Retinoic acid receptor RXR-alpha
Name:Retinoic acid receptor RXR-alpha
Type:PROTEIN
Mol. Mass.:51225.80
Organism:Mus musculus
Description:ChEMBL_196493
Residue:467
BDBM50407929
NameBDBM50407929
Synonyms:CHEMBL2111791
TypeSmall organic molecule
Emp. Form.C16H20O2
Mol. Mass.244.3288
SMILESC\C(\C=C\C=C(/C)\C=C1\CCCC=C1)=C/C(O)=O