Reaction Details
TargetLeukotriene B4 receptor 1
LigandBDBM50053351
Substrate/Competitorn/a
Meas. Tech.ChEMBL_99831 (CHEMBL709861)
Ki 1.5±n/a nM
Citation Daines, RAChambers, PAFoley, JJGriswold, DEKingsbury, WDMartin, LDSchmidt, DBSham, KKSarau, HM (E)-3-[6-[[(2,6-dichlorophenyl)thio]methyl]-3-(2-phenylethoxy)-2- pyridinyl]-2-propenoic acid: a high-affinity leukotriene B4 receptor antagonist with oral antiinflammatory activity. J Med Chem39:3837-41 (1996) 
 
Leukotriene B4 receptor 1
Name:Leukotriene B4 receptor 1
Type:Enzyme Catalytic Domain
Mol. Mass.:37582.68
Organism:Homo sapiens (Human)
Description:Q15722
Residue:352
BDBM50053351
NameBDBM50053351
Synonyms:(E)-3-{6-(2,6-Dichloro-phenylsulfanylmethyl)-3-[4-(4-methoxy-phenyl)-butoxy]-pyridin-2-yl}-acrylic acid | CHEMBL337995
TypeSmall organic molecule
Emp. Form.C26H25Cl2NO4S
Mol. Mass.518.452
SMILESCOc1ccc(CCCCOc2ccc(CSc3c(Cl)cccc3Cl)nc2\C=C\C(O)=O)cc1