Reaction Details
TargetLeukotriene B4 receptor 1
LigandBDBM50053352
Substrate/Competitorn/a
Meas. Tech.ChEMBL_99831 (CHEMBL709861)
Ki 12±n/a nM
Citation Daines, RAChambers, PAFoley, JJGriswold, DEKingsbury, WDMartin, LDSchmidt, DBSham, KKSarau, HM (E)-3-[6-[[(2,6-dichlorophenyl)thio]methyl]-3-(2-phenylethoxy)-2- pyridinyl]-2-propenoic acid: a high-affinity leukotriene B4 receptor antagonist with oral antiinflammatory activity. J Med Chem39:3837-41 (1996) 
 
Leukotriene B4 receptor 1
Name:Leukotriene B4 receptor 1
Type:Enzyme Catalytic Domain
Mol. Mass.:37582.68
Organism:Homo sapiens (Human)
Description:Q15722
Residue:352
BDBM50053352
NameBDBM50053352
Synonyms:(E)-3-[6-(2,6-Dichloro-phenylsulfanylmethyl)-3-(4-fluoro-benzyloxy)-pyridin-2-yl]-acrylic acid | CHEMBL127341
TypeSmall organic molecule
Emp. Form.C22H16Cl2FNO3S
Mol. Mass.464.337
SMILESOC(=O)\C=C\c1nc(CSc2c(Cl)cccc2Cl)ccc1OCc1ccc(F)cc1