Reaction Details
TargetCannabinoid receptor 2
LigandBDBM50454329
Substrate/Competitorn/a
Meas. Tech.ChEMBL_46976 (CHEMBL658878)
Ki 0.032000±n/a nM
Citation Huffman, JWYu, SShowalter, VAbood, MEWiley, JLCompton, DRMartin, BRBramblett, RDReggio, PH Synthesis and pharmacology of a very potent cannabinoid lacking a phenolic hydroxyl with high affinity for the CB2 receptor. J Med Chem39:3875-7 (1996) 
 
Cannabinoid receptor 2
Name:Cannabinoid receptor 2
Type:G Protein-Coupled Receptor (GPCR)
Mol. Mass.:39690.94
Organism:Homo sapiens (Human)
Description:P34972
Residue:360
BDBM50454329
NameBDBM50454329
Synonyms:CHEMBL2112647
TypeSmall organic molecule
Emp. Form.C25H38O2
Mol. Mass.370.568
SMILES[H][C@@]12CC(CO)=CC[C@@]1([H])C(C)(C)Oc1cc(CCCCCC(C)(C)C)ccc21