Reaction Details
TargetCannabinoid receptor 1
LigandBDBM50053357
Substrate/Competitorn/a
Meas. Tech.ChEMBL_46830 (CHEMBL875683)
Ki 0.73±n/a nM
Citation Huffman, JWYu, SShowalter, VAbood, MEWiley, JLCompton, DRMartin, BRBramblett, RDReggio, PH Synthesis and pharmacology of a very potent cannabinoid lacking a phenolic hydroxyl with high affinity for the CB2 receptor. J Med Chem39:3875-7 (1996) 
 
Cannabinoid receptor 1
Name:Cannabinoid receptor 1
Type:G Protein-Coupled Receptor (GPCR)
Mol. Mass.:52868.96
Organism:Homo sapiens (Human)
Description:P21554
Residue:472
BDBM50053357
NameBDBM50053357
Synonyms:(6aR,10aR)-9-Hydroxymethyl-6,6-dimethyl-3-nonyl-6a,7,10,10a-tetrahydro-6H-benzo[c]chromen-1-ol | CHEMBL338484
TypeSmall organic molecule
Emp. Form.C25H38O3
Mol. Mass.386.5674
SMILESCCCCCCCCCc1cc(O)c2[C@@H]3CC(CO)=CC[C@H]3C(C)(C)Oc2c1