Reaction Details
TargetReduced folate transporter
LigandBDBM50354833
Substrate/Competitorn/a
Meas. Tech.ChEMBL_1809823 (CHEMBL4309283)
IC50 106±n/a nM
Citation Ravindra, MWilson, MRTong, NO'Connor, CKarim, MPolin, LWallace-Povirk, AWhite, KKushner, JHou, ZMatherly, LHGangjee, A Fluorine-Substituted Pyrrolo[2,3- d]Pyrimidine Analogues with Tumor Targeting via Cellular Uptake by Folate Receptor ? and the Proton-Coupled Folate Transporter and Inhibition of de Novo Purine Nucleotide Biosynthesis. J Med Chem61:4228-4248 (2018) 
 
Reduced folate transporter
Name:Reduced folate transporter
Type:PROTEIN
Mol. Mass.:64885.16
Organism:Homo sapiens (Human)
Description:ChEMBL_1469594
Residue:591
BDBM50354833
NameBDBM50354833
Synonyms:AGF94 | CHEMBL1834488
TypeSmall organic molecule
Emp. Form.C19H21N5O6S
Mol. Mass.447.465
SMILESNc1nc2[nH]c(CCCc3ccc(s3)C(=O)N[C@@H](CCC(O)=O)C(O)=O)cc2c(=O)[nH]1