Reaction Details
TargetReduced folate transporter
LigandBDBM50503240
Substrate/Competitorn/a
Meas. Tech.ChEMBL_1809823 (CHEMBL4309283)
IC50 20±n/a nM
Citation Ravindra, MWilson, MRTong, NO'Connor, CKarim, MPolin, LWallace-Povirk, AWhite, KKushner, JHou, ZMatherly, LHGangjee, A Fluorine-Substituted Pyrrolo[2,3- d]Pyrimidine Analogues with Tumor Targeting via Cellular Uptake by Folate Receptor ? and the Proton-Coupled Folate Transporter and Inhibition of de Novo Purine Nucleotide Biosynthesis. J Med Chem61:4228-4248 (2018) 
 
Reduced folate transporter
Name:Reduced folate transporter
Type:PROTEIN
Mol. Mass.:64885.16
Organism:Homo sapiens (Human)
Description:ChEMBL_1469594
Residue:591
BDBM50503240
NameBDBM50503240
Synonyms:CHEMBL4445651
TypeSmall organic molecule
Emp. Form.C19H20FN5O6S
Mol. Mass.465.455
SMILESNc1nc2[nH]c(CCCc3csc(C(=O)N[C@@H](CCC(O)=O)C(O)=O)c3F)cc2c(=O)[nH]1