Reaction Details
TargetReduced folate transporter
LigandBDBM50027656
Substrate/Competitorn/a
Meas. Tech.ChEMBL_1809823 (CHEMBL4309283)
IC50 26±n/a nM
Citation Ravindra, MWilson, MRTong, NO'Connor, CKarim, MPolin, LWallace-Povirk, AWhite, KKushner, JHou, ZMatherly, LHGangjee, A Fluorine-Substituted Pyrrolo[2,3- d]Pyrimidine Analogues with Tumor Targeting via Cellular Uptake by Folate Receptor ? and the Proton-Coupled Folate Transporter and Inhibition of de Novo Purine Nucleotide Biosynthesis. J Med Chem61:4228-4248 (2018) 
 
Reduced folate transporter
Name:Reduced folate transporter
Type:PROTEIN
Mol. Mass.:64885.16
Organism:Homo sapiens (Human)
Description:ChEMBL_1469594
Residue:591
BDBM50027656
NameBDBM50027656
Synonyms:CHEBI:63616 LY-231514 US9422297, Pemetrexed
TypeSmall organic molecule
Emp. Form.C20H21N5O6
Mol. Mass.427.4106
SMILESNc1nc2[nH]cc(CCc3ccc(cc3)C(=O)N[C@@H](CCC(O)=O)C(O)=O)c2c(=O)[nH]1