Reaction Details
TargetReduced folate transporter
LigandBDBM50457435
Substrate/Competitorn/a
Meas. Tech.ChEMBL_1809828 (CHEMBL4309288)
IC50 634±n/a nM
Citation Ravindra, MWilson, MRTong, NO'Connor, CKarim, MPolin, LWallace-Povirk, AWhite, KKushner, JHou, ZMatherly, LHGangjee, A Fluorine-Substituted Pyrrolo[2,3- d]Pyrimidine Analogues with Tumor Targeting via Cellular Uptake by Folate Receptor ? and the Proton-Coupled Folate Transporter and Inhibition of de Novo Purine Nucleotide Biosynthesis. J Med Chem61:4228-4248 (2018) 
 
Reduced folate transporter
Name:Reduced folate transporter
Type:PROTEIN
Mol. Mass.:64885.16
Organism:Homo sapiens (Human)
Description:ChEMBL_1469594
Residue:591
BDBM50457435
NameBDBM50457435
Synonyms:CHEMBL4214638
TypeSmall organic molecule
Emp. Form.C21H24N6O6
Mol. Mass.456.4519
SMILESNc1nc2[nH]c(CCCCc3ccc(nc3)C(=O)N[C@@H](CCC(O)=O)C(O)=O)cc2c(=O)[nH]1