Reaction Details
TargetReduced folate transporter
LigandBDBM50171513
Substrate/Competitorn/a
Meas. Tech.ChEMBL_1809823 (CHEMBL4309283)
IC50 304±n/a nM
Citation Ravindra, MWilson, MRTong, NO'Connor, CKarim, MPolin, LWallace-Povirk, AWhite, KKushner, JHou, ZMatherly, LHGangjee, A Fluorine-Substituted Pyrrolo[2,3- d]Pyrimidine Analogues with Tumor Targeting via Cellular Uptake by Folate Receptor ? and the Proton-Coupled Folate Transporter and Inhibition of de Novo Purine Nucleotide Biosynthesis. J Med Chem61:4228-4248 (2018) 
 
Reduced folate transporter
Name:Reduced folate transporter
Type:PROTEIN
Mol. Mass.:64885.16
Organism:Homo sapiens (Human)
Description:ChEMBL_1469594
Residue:591
BDBM50171513
NameBDBM50171513
Synonyms:(S)-2-(4-(3-(2-amino-4-oxo-4,7-dihydro-3H-pyrrolo[2,3-d]pyrimidin-6-yl)propyl)benzamido)pentanedioic acid CHEMBL192632
TypeSmall organic molecule
Emp. Form.C21H23N5O6
Mol. Mass.441.4372
SMILESNc1nc2[nH]c(CCCc3ccc(cc3)C(=O)N[C@@H](CCC(O)=O)C(O)=O)cc2c(=O)[nH]1