Reaction Details
TargetCalpain-2 catalytic subunit
LigandBDBM50053864
Substrate/Competitorn/a
Meas. Tech.ChEMBL_43853 (CHEMBL658514)
Ki 33.0±n/a nM
Citation Li, ZOrtega-Vilain, ACPatil, GSChu, DLForeman, JEEveleth, DDPowers, JC Novel peptidyl alpha-keto amide inhibitors of calpains and other cysteine proteases. J Med Chem39:4089-98 (1996) 
 
Calpain-2 catalytic subunit
Name:Calpain-2 catalytic subunit
Type:Protein
Mol. Mass.:79965.18
Organism:Homo sapiens (Human)
Description:n/a
Residue:700
BDBM50053864
NameBDBM50053864
Synonyms:CHEMBL424074 | {1-[1-(Furan-2-ylmethyl)-aminooxalyl]-propylcarbamoyl}-3-methyl-butyl)-carbamic acid benzyl ester
TypeSmall organic molecule
Emp. Form.C24H31N3O6
Mol. Mass.457.5194
SMILESCCC(NC(=O)C(CC(C)C)NC(=O)OCc1ccccc1)C(=O)C(=O)NCc1ccco1