Reaction Details
TargetCalpain-2 catalytic subunit
LigandBDBM50053851
Substrate/Competitorn/a
Meas. Tech.ChEMBL_43853 (CHEMBL658514)
Ki 0.200000±n/a nM
Citation Li, ZOrtega-Vilain, ACPatil, GSChu, DLForeman, JEEveleth, DDPowers, JC Novel peptidyl alpha-keto amide inhibitors of calpains and other cysteine proteases. J Med Chem39:4089-98 (1996) 
 
Calpain-2 catalytic subunit
Name:Calpain-2 catalytic subunit
Type:Protein
Mol. Mass.:79965.18
Organism:Homo sapiens (Human)
Description:n/a
Residue:700
BDBM50053851
NameBDBM50053851
Synonyms:(3-Methyl-1-{1-[3-(3,4,4a,8a-tetrahydro-2H-quinolin-1-yl)-propylaminooxalyl]-propylcarbamoyl}-butyl)-carbamic acid benzyl ester | CHEMBL337635
TypeSmall organic molecule
Emp. Form.C31H44N4O5
Mol. Mass.552.7049
SMILESCCC(NC(=O)C(CC(C)C)NC(=O)OCc1ccccc1)C(=O)C(=O)NCCCN1CCCC2C=CC=CC12