Reaction Details
TargetCalpain-2 catalytic subunit
LigandBDBM50042386
Substrate/Competitorn/a
Meas. Tech.ChEMBL_43853 (CHEMBL658514)
Ki 210±n/a nM
Citation Li, ZOrtega-Vilain, ACPatil, GSChu, DLForeman, JEEveleth, DDPowers, JC Novel peptidyl alpha-keto amide inhibitors of calpains and other cysteine proteases. J Med Chem39:4089-98 (1996) 
 
Calpain-2 catalytic subunit
Name:Calpain-2 catalytic subunit
Type:Protein
Mol. Mass.:79965.18
Organism:Homo sapiens (Human)
Description:n/a
Residue:700
BDBM50042386
NameBDBM50042386
Synonyms:CHEMBL325147 | [1-(1-Ethylaminooxalyl-propylcarbamoyl)-3-methyl-butyl]-carbamic acid benzyl ester
TypeSmall organic molecule
Emp. Form.C21H31N3O5
Mol. Mass.405.4879
SMILESCCNC(=O)C(=O)C(CC)NC(=O)C(CC(C)C)NC(=O)OCc1ccccc1