Reaction Details
TargetCalpain-2 catalytic subunit
LigandBDBM50053825
Substrate/Competitorn/a
Meas. Tech.ChEMBL_43853 (CHEMBL658514)
Ki 100.0±n/a nM
Citation Li, ZOrtega-Vilain, ACPatil, GSChu, DLForeman, JEEveleth, DDPowers, JC Novel peptidyl alpha-keto amide inhibitors of calpains and other cysteine proteases. J Med Chem39:4089-98 (1996) 
 
Calpain-2 catalytic subunit
Name:Calpain-2 catalytic subunit
Type:Protein
Mol. Mass.:79965.18
Organism:Homo sapiens (Human)
Description:n/a
Residue:700
BDBM50053825
NameBDBM50053825
Synonyms:(1-{1-[2-(3,4-Bis-benzyloxy-phenyl)-2-hydroxy-ethylaminooxalyl]-propylcarbamoyl}-3-methyl-butyl)-carbamic acid benzyl ester | CHEMBL130146
TypeSmall organic molecule
Emp. Form.C41H47N3O8
Mol. Mass.709.8272
SMILESCCC(NC(=O)C(CC(C)C)NC(=O)OCc1ccccc1)C(=O)C(=O)NCC(O)c1ccc(OCc2ccccc2)c(OCc2ccccc2)c1