Reaction Details
TargetCalpain-2 catalytic subunit
LigandBDBM50053822
Substrate/Competitorn/a
Meas. Tech.ChEMBL_43853 (CHEMBL658514)
Ki 120±n/a nM
Citation Li, ZOrtega-Vilain, ACPatil, GSChu, DLForeman, JEEveleth, DDPowers, JC Novel peptidyl alpha-keto amide inhibitors of calpains and other cysteine proteases. J Med Chem39:4089-98 (1996) 
 
Calpain-2 catalytic subunit
Name:Calpain-2 catalytic subunit
Type:Protein
Mol. Mass.:79965.18
Organism:Homo sapiens (Human)
Description:n/a
Residue:700
BDBM50053822
NameBDBM50053822
Synonyms:CHEMBL132586 {3-Methyl-1-[1-(pyridin-2-ylmethyl)-aminooxalyl]-butylcarbamoyl}-butyl)-carbamic acid benzyl ester
TypeSmall organic molecule
Emp. Form.C26H34N4O5
Mol. Mass.482.572
SMILESCCCC(NC(=O)C(CC(C)C)NC(=O)OCc1ccccc1)C(=O)C(=O)NCc1ccccn1