Reaction Details
TargetCalpain-2 catalytic subunit
LigandBDBM50053848
Substrate/Competitorn/a
Meas. Tech.ChEMBL_43853 (CHEMBL658514)
Ki 480±n/a nM
Citation Li, ZOrtega-Vilain, ACPatil, GSChu, DLForeman, JEEveleth, DDPowers, JC Novel peptidyl alpha-keto amide inhibitors of calpains and other cysteine proteases. J Med Chem39:4089-98 (1996) 
 
Calpain-2 catalytic subunit
Name:Calpain-2 catalytic subunit
Type:Protein
Mol. Mass.:79965.18
Organism:Homo sapiens (Human)
Description:n/a
Residue:700
BDBM50053848
NameBDBM50053848
Synonyms:CHEMBL337462 | Pyrazine-2-carboxylic acid [1-(1-ethylaminooxalyl-propylcarbamoyl)-3-methyl-butyl]-amide
TypeSmall organic molecule
Emp. Form.C18H27N5O4
Mol. Mass.377.4381
SMILESCCNC(=O)C(=O)C(CC)NC(=O)C(CC(C)C)NC(=O)c1cnccn1