Reaction Details
TargetCalpain-2 catalytic subunit
LigandBDBM50053793
Substrate/Competitorn/a
Meas. Tech.ChEMBL_43853 (CHEMBL658514)
Ki 23.0±n/a nM
Citation Li, ZOrtega-Vilain, ACPatil, GSChu, DLForeman, JEEveleth, DDPowers, JC Novel peptidyl alpha-keto amide inhibitors of calpains and other cysteine proteases. J Med Chem39:4089-98 (1996) 
 
Calpain-2 catalytic subunit
Name:Calpain-2 catalytic subunit
Type:Protein
Mol. Mass.:79965.18
Organism:Homo sapiens (Human)
Description:n/a
Residue:700
BDBM50053793
NameBDBM50053793
Synonyms:(1-{1-Benzyl-2-oxo-2-[(quinolin-2-ylmethyl)-carbamoyl]-ethylcarbamoyl}-3-methyl-butyl)-carbamic acid benzyl ester | CHEMBL134283
TypeSmall organic molecule
Emp. Form.C34H36N4O5
Mol. Mass.580.6734
SMILESCC(C)CC(NC(=O)OCc1ccccc1)C(=O)NC(Cc1ccccc1)C(=O)C(=O)NCc1ccc2ccccc2n1