Reaction Details
TargetCalpain-2 catalytic subunit
LigandBDBM50053858
Substrate/Competitorn/a
Meas. Tech.ChEMBL_43853 (CHEMBL658514)
Ki 100.0±n/a nM
Citation Li, ZOrtega-Vilain, ACPatil, GSChu, DLForeman, JEEveleth, DDPowers, JC Novel peptidyl alpha-keto amide inhibitors of calpains and other cysteine proteases. J Med Chem39:4089-98 (1996) 
 
Calpain-2 catalytic subunit
Name:Calpain-2 catalytic subunit
Type:Protein
Mol. Mass.:79965.18
Organism:Homo sapiens (Human)
Description:n/a
Residue:700
BDBM50053858
NameBDBM50053858
Synonyms:CHEMBL336649 | {3-Methyl-1-[1-(3-morpholin-4-yl-propylaminooxalyl)-butylcarbamoyl]-butyl}-carbamic acid benzyl ester
TypeSmall organic molecule
Emp. Form.C27H42N4O6
Mol. Mass.518.6456
SMILESCCCC(NC(=O)C(CC(C)C)NC(=O)OCc1ccccc1)C(=O)C(=O)NCCCN1CCOCC1