Reaction Details
TargetCalpain-1 catalytic subunit
LigandBDBM50053847
Substrate/Competitorn/a
Meas. Tech.ChEMBL_43668 (CHEMBL656201)
Ki 300±n/a nM
Citation Li, ZOrtega-Vilain, ACPatil, GSChu, DLForeman, JEEveleth, DDPowers, JC Novel peptidyl alpha-keto amide inhibitors of calpains and other cysteine proteases. J Med Chem39:4089-98 (1996) 
 
Calpain-1 catalytic subunit
Name:Calpain-1 catalytic subunit
Type:Protein
Mol. Mass.:81880.51
Organism:Homo sapiens (Human)
Description:n/a
Residue:714
BDBM50053847
NameBDBM50053847
Synonyms:(1-{1-[2-(1H-Indol-3-yl)-ethylaminooxalyl]-propylcarbamoyl}-3-methyl-butyl)-carbamic acid benzyl ester | CHEMBL131540
TypeSmall organic molecule
Emp. Form.C29H36N4O5
Mol. Mass.520.6199
SMILESCCC(NC(=O)C(CC(C)C)NC(=O)OCc1ccccc1)C(=O)C(=O)NCCc1c[nH]c2ccccc12