Reaction Details
TargetCathepsin B
LigandBDBM50053834
Substrate/Competitorn/a
Meas. Tech.ChEMBL_47385 (CHEMBL659000)
Ki 120±n/a nM
Citation Li, ZOrtega-Vilain, ACPatil, GSChu, DLForeman, JEEveleth, DDPowers, JC Novel peptidyl alpha-keto amide inhibitors of calpains and other cysteine proteases. J Med Chem39:4089-98 (1996) 
 
Cathepsin B
Name:Cathepsin B
Type:Enzyme
Mol. Mass.:36657.87
Organism:Bos taurus (bovine)
Description:Bovine spleen CB was purchased from Sigma Co. (USA).
Residue:335
BDBM50053834
NameBDBM50053834
Synonyms:CHEMBL413308 | [1-(1-Benzyl-2-{2-hydroxy-2-[3-(3-trifluoromethyl-phenoxy)-phenyl]-ethylcarbamoyl}-2-oxo-ethylcarbamoyl)-3-methyl-butyl]-carbamic acid benzyl ester
TypeSmall organic molecule
Emp. Form.C39H40F3N3O7
Mol. Mass.719.746
SMILESCC(C)CC(NC(=O)OCc1ccccc1)C(=O)NC(Cc1ccccc1)C(=O)C(=O)NCC(O)c1cccc(Oc2cccc(c2)C(F)(F)F)c1