Reaction Details
TargetCalpain-1 catalytic subunit
LigandBDBM50053857
Substrate/Competitorn/a
Meas. Tech.ChEMBL_43668 (CHEMBL656201)
Ki 100.0±n/a nM
Citation Li, ZOrtega-Vilain, ACPatil, GSChu, DLForeman, JEEveleth, DDPowers, JC Novel peptidyl alpha-keto amide inhibitors of calpains and other cysteine proteases. J Med Chem39:4089-98 (1996) 
 
Calpain-1 catalytic subunit
Name:Calpain-1 catalytic subunit
Type:Protein
Mol. Mass.:81880.51
Organism:Homo sapiens (Human)
Description:n/a
Residue:714
BDBM50053857
NameBDBM50053857
Synonyms:(1-{1-[2-Hydroxy-2-(4-phenoxy-phenyl)-ethylaminooxalyl]-propylcarbamoyl}-3-methyl-butyl)-carbamic acid benzyl ester | CHEMBL131002
TypeSmall organic molecule
Emp. Form.C33H39N3O7
Mol. Mass.589.6787
SMILESCCC(NC(=O)C(CC(C)C)NC(=O)OCc1ccccc1)C(=O)C(=O)NCC(O)c1ccc(Oc2ccccc2)cc1