Reaction Details
TargetCalpain-1 catalytic subunit
LigandBDBM50053812
Substrate/Competitorn/a
Meas. Tech.ChEMBL_43668 (CHEMBL656201)
Ki 850±n/a nM
Citation Li, ZOrtega-Vilain, ACPatil, GSChu, DLForeman, JEEveleth, DDPowers, JC Novel peptidyl alpha-keto amide inhibitors of calpains and other cysteine proteases. J Med Chem39:4089-98 (1996) 
 
Calpain-1 catalytic subunit
Name:Calpain-1 catalytic subunit
Type:Protein
Mol. Mass.:81880.51
Organism:Homo sapiens (Human)
Description:n/a
Residue:714
BDBM50053812
NameBDBM50053812
Synonyms:CHEMBL131257 | Furan-2-carboxylic acid [1-(1-ethylaminooxalyl-propylcarbamoyl)-3-methyl-butyl]-amide
TypeSmall organic molecule
Emp. Form.C18H27N3O5
Mol. Mass.365.4241
SMILESCCNC(=O)C(=O)C(CC)NC(=O)C(CC(C)C)NC(=O)c1ccco1