Reaction Details
TargetCathepsin B
LigandBDBM50042395
Substrate/Competitorn/a
Meas. Tech.ChEMBL_47427 (CHEMBL662614)
Ki 1300±n/a nM
Citation Li, ZOrtega-Vilain, ACPatil, GSChu, DLForeman, JEEveleth, DDPowers, JC Novel peptidyl alpha-keto amide inhibitors of calpains and other cysteine proteases. J Med Chem39:4089-98 (1996) 
 
Cathepsin B
Name:Cathepsin B
Type:Enzyme
Mol. Mass.:37819.69
Organism:Homo sapiens (Human)
Description:gi_63102437
Residue:339
BDBM50042395
NameBDBM50042395
Synonyms:CHEMBL117336 | [3-Methyl-1-(1-phenethylaminooxalyl-propylcarbamoyl)-butyl]-carbamic acid benzyl ester
TypeSmall organic molecule
Emp. Form.C27H35N3O5
Mol. Mass.481.5839
SMILESCCC(NC(=O)C(CC(C)C)NC(=O)OCc1ccccc1)C(=O)C(=O)NCCc1ccccc1