Reaction Details
TargetCathepsin B
LigandBDBM50053793
Substrate/Competitorn/a
Meas. Tech.ChEMBL_47427 (CHEMBL662614)
Ki 340±n/a nM
Citation Li, ZOrtega-Vilain, ACPatil, GSChu, DLForeman, JEEveleth, DDPowers, JC Novel peptidyl alpha-keto amide inhibitors of calpains and other cysteine proteases. J Med Chem39:4089-98 (1996) 
 
Cathepsin B
Name:Cathepsin B
Type:Enzyme
Mol. Mass.:37819.69
Organism:Homo sapiens (Human)
Description:gi_63102437
Residue:339
BDBM50053793
NameBDBM50053793
Synonyms:(1-{1-Benzyl-2-oxo-2-[(quinolin-2-ylmethyl)-carbamoyl]-ethylcarbamoyl}-3-methyl-butyl)-carbamic acid benzyl ester | CHEMBL134283
TypeSmall organic molecule
Emp. Form.C34H36N4O5
Mol. Mass.580.6734
SMILESCC(C)CC(NC(=O)OCc1ccccc1)C(=O)NC(Cc1ccccc1)C(=O)C(=O)NCc1ccc2ccccc2n1