Reaction Details
TargetCathepsin B
LigandBDBM50053855
Substrate/Competitorn/a
Meas. Tech.ChEMBL_47427 (CHEMBL662614)
Ki 2800±n/a nM
Citation Li, ZOrtega-Vilain, ACPatil, GSChu, DLForeman, JEEveleth, DDPowers, JC Novel peptidyl alpha-keto amide inhibitors of calpains and other cysteine proteases. J Med Chem39:4089-98 (1996) 
 
Cathepsin B
Name:Cathepsin B
Type:Enzyme
Mol. Mass.:37819.69
Organism:Homo sapiens (Human)
Description:gi_63102437
Residue:339
BDBM50053855
NameBDBM50053855
Synonyms:3-(2-Diphenylacetylamino-4-methyl-pentanoylamino)-2-oxo-pentanoic acid (pyridin-2-ylmethyl)-amide | CHEMBL423704
TypeSmall organic molecule
Emp. Form.C31H36N4O4
Mol. Mass.528.6419
SMILESCCC(NC(=O)C(CC(C)C)NC(=O)C(c1ccccc1)c1ccccc1)C(=O)C(=O)NCc1ccccn1