Reaction Details
TargetCathepsin B
LigandBDBM50053861
Substrate/Competitorn/a
Meas. Tech.ChEMBL_47385 (CHEMBL659000)
Ki 170±n/a nM
Citation Li, ZOrtega-Vilain, ACPatil, GSChu, DLForeman, JEEveleth, DDPowers, JC Novel peptidyl alpha-keto amide inhibitors of calpains and other cysteine proteases. J Med Chem39:4089-98 (1996) 
 
Cathepsin B
Name:Cathepsin B
Type:Enzyme
Mol. Mass.:36657.87
Organism:Bos taurus (bovine)
Description:Bovine spleen CB was purchased from Sigma Co. (USA).
Residue:335
BDBM50053861
NameBDBM50053861
Synonyms:3-(2-Diphenylacetylamino-4-methyl-pentanoylamino)-2-oxo-pentanoic acid (2-hydroxy-2-phenyl-ethyl)-amide | CHEMBL132526
TypeSmall organic molecule
Emp. Form.C33H39N3O5
Mol. Mass.557.6799
SMILESCCC(NC(=O)C(CC(C)C)NC(=O)C(c1ccccc1)c1ccccc1)C(=O)C(=O)NCC(O)c1ccccc1