Reaction Details
TargetCathepsin B
LigandBDBM50053837
Substrate/Competitorn/a
Meas. Tech.ChEMBL_47427 (CHEMBL662614)
Ki 2000±n/a nM
Citation Li, ZOrtega-Vilain, ACPatil, GSChu, DLForeman, JEEveleth, DDPowers, JC Novel peptidyl alpha-keto amide inhibitors of calpains and other cysteine proteases. J Med Chem39:4089-98 (1996) 
 
Cathepsin B
Name:Cathepsin B
Type:Enzyme
Mol. Mass.:37819.69
Organism:Homo sapiens (Human)
Description:gi_63102437
Residue:339
BDBM50053837
NameBDBM50053837
Synonyms:(1-{1-[2-(2-Hydroxy-ethoxy)-ethylaminooxalyl]-propylcarbamoyl}-3-methyl-butyl)-carbamic acid benzyl ester | CHEMBL131264
TypeSmall organic molecule
Emp. Form.C23H35N3O7
Mol. Mass.465.5399
SMILESCCC(NC(=O)C(CC(C)C)NC(=O)OCc1ccccc1)C(=O)C(=O)NCCOCCO