Reaction Details
TargetCalpain-1 catalytic subunit
LigandBDBM50053805
Substrate/Competitorn/a
Meas. Tech.ChEMBL_43668 (CHEMBL656201)
Ki 200±n/a nM
Citation Li, ZOrtega-Vilain, ACPatil, GSChu, DLForeman, JEEveleth, DDPowers, JC Novel peptidyl alpha-keto amide inhibitors of calpains and other cysteine proteases. J Med Chem39:4089-98 (1996) 
 
Calpain-1 catalytic subunit
Name:Calpain-1 catalytic subunit
Type:Protein
Mol. Mass.:81880.51
Organism:Homo sapiens (Human)
Description:n/a
Residue:714
BDBM50053805
NameBDBM50053805
Synonyms:(1-{1-Benzyl-2-[2-(4-benzyloxy-phenyl)-2-hydroxy-ethylcarbamoyl]-2-oxo-ethylcarbamoyl}-3-methyl-butyl)-carbamic acid benzyl ester | CHEMBL337830
TypeSmall organic molecule
Emp. Form.C39H43N3O7
Mol. Mass.665.7746
SMILESCC(C)CC(NC(=O)OCc1ccccc1)C(=O)NC(Cc1ccccc1)C(=O)C(=O)NCC(O)c1ccc(OCc2ccccc2)cc1