Reaction Details
TargetVoltage-dependent L-type calcium channel subunit alpha-1S
LigandBDBM50053882
Substrate/Competitorn/a
Meas. Tech.ChEMBL_92776 (CHEMBL700076)
Ki 1000±n/a nM
Citation Dhainaut, ARegnier, GTizot, APierre, ALeonce, SGuilbaud, NKraus-Berthier, LAtassi, G New purines and purine analogs as modulators of multidrug resistance. J Med Chem39:4099-108 (1996) 
 
Voltage-dependent L-type calcium channel subunit alpha-1S
Name:Voltage-dependent L-type calcium channel subunit alpha-1S
Type:PROTEIN
Mol. Mass.:210392.58
Organism:Rattus norvegicus
Description:ChEMBL_92777
Residue:1850
BDBM50053882
NameBDBM50053882
Synonyms:CHEMBL340348 | [1-(9-Allyl-6-allylamino-9H-purin-2-yl)-piperidin-4-yl]-(8-chloro-11-methyl-10,10-dioxo-10,11-dihydro-5H-10lambda*6*-thia-11-aza-dibenzo[a,d]cyclohepten-5-yl)-amine
TypeSmall organic molecule
Emp. Form.C30H33ClN8O2S
Mol. Mass.605.153
SMILESCN1c2ccccc2C(NC2CCN(CC2)c2nc(NCC=C)c3ncn(CC=C)c3n2)c2ccc(Cl)cc2S1(=O)=O