Reaction Details
TargetVoltage-dependent L-type calcium channel subunit alpha-1S
LigandBDBM50053892
Substrate/Competitorn/a
Meas. Tech.ChEMBL_92776 (CHEMBL700076)
Ki 62±n/a nM
Citation Dhainaut, ARegnier, GTizot, APierre, ALeonce, SGuilbaud, NKraus-Berthier, LAtassi, G New purines and purine analogs as modulators of multidrug resistance. J Med Chem39:4099-108 (1996) 
 
Voltage-dependent L-type calcium channel subunit alpha-1S
Name:Voltage-dependent L-type calcium channel subunit alpha-1S
Type:PROTEIN
Mol. Mass.:210392.58
Organism:Rattus norvegicus
Description:ChEMBL_92777
Residue:1850
BDBM50053892
NameBDBM50053892
Synonyms:Allyl-(9-allyl-2-{4-[(6,7,8,9-tetrahydro-5H-benzocyclohepten-5-ylmethyl)-amino]-piperidin-1-yl}-9H-purin-6-yl)-amine | CHEMBL132844
TypeSmall organic molecule
Emp. Form.C28H37N7
Mol. Mass.471.6403
SMILESC=CCNc1nc(nc2n(CC=C)cnc12)N1CCC(CC1)NCC1CCCCc2ccccc12