Reaction Details
TargetBromodomain-containing protein 3
LigandBDBM50365262
Substrate/Competitorn/a
Meas. Tech.ChEMBL_1810626 (CHEMBL4310086)
Kd 82±n/a nM
Citation Divakaran, ATalluri, SKAyoub, AMMishra, NKCui, HWiden, JCBerndt, NZhu, JYCarlson, ASTopczewski, JJSchonbrunn, EKHarki, DAPomerantz, WCK Molecular Basis for the N-Terminal Bromodomain-and-Extra-Terminal-Family Selectivity of a Dual Kinase-Bromodomain Inhibitor. J Med Chem61:9316-9334 (2018) 
 
Bromodomain-containing protein 3
Name:Bromodomain-containing protein 3
Type:Protein
Mol. Mass.:79571.81
Organism:Homo sapiens (Human)
Description:Q15059
Residue:726
BDBM50365262
NameBDBM50365262
Synonyms:(+)-JQ1 CHEMBL1957266 US10124009, Compound (S)-JQ1 US10308662, Compound JQ-1 US10617680, Example JQ-1 US10925881, Name (S)-JQ1 US11078188, Example (+)-JQ1 US11427593, Compound JQ1 US9320741, (S)-JQ1 | US9695172, JQ1
TypeSmall organic molecule
Emp. Form.C23H25ClN4O2S
Mol. Mass.456.988
SMILESCc1nnc2[C@H](CC(=O)OC(C)(C)C)N=C(c3c(C)c(C)sc3-n12)c1ccc(Cl)cc1