Reaction Details
TargetGag-Pol polyprotein [489-587]
LigandBDBM50053906
Substrate/Competitorn/a
Meas. Tech.ChEMBL_157546 (CHEMBL764930)
Ki 0.175±n/a nM
Citation Romines, KRMorris, JKHowe, WJTomich, PKHorng, MMChong, KTHinshaw, RRAnderson, DJStrohbach, JWTurner, SRMizsak, SA Cycloalkylpyranones and cycloalkyldihydropyrones as HIV protease inhibitors: exploring the impact of ring size on structure-activity relationships. J Med Chem39:4125-30 (1996) 
 
Gag-Pol polyprotein [489-587]
Name:Gag-Pol polyprotein [489-587]
Type:Enzyme Subunit
Mol. Mass.:10781.16
Organism:Human immunodeficiency virus type 1
Description:P04585[489-587]
Residue:99
BDBM50053906
NameBDBM50053906
Synonyms:4-Cyano-N-{3-[1-(4-hydroxy-2-oxo-4a,5,6,7,8,9,10,10a-octahydro-2H-cycloocta[b]pyran-3-yl)-propyl]-phenyl}-benzenesulfonamide | CHEMBL133804
TypeSmall organic molecule
Emp. Form.C27H30N2O5S
Mol. Mass.494.603
SMILESCCC(C1C(=O)OC2CCCCCCC2C1=O)c1cccc(NS(=O)(=O)c2ccc(cc2)C#N)c1