Reaction Details
TargetAdenosine receptor A3
LigandBDBM50053924
Substrate/Competitorn/a
Meas. Tech.ChEMBL_31845 (CHEMBL641522)
Ki 0.56±n/a nM
Citation Kim, YCJi, XDJacobson, KA Derivatives of the triazoloquinazoline adenosine antagonist (CGS15943) are selective for the human A3 receptor subtype. J Med Chem39:4142-8 (1996) 
 
Adenosine receptor A3
Name:Adenosine receptor A3
Type:G Protein-Coupled Receptor (GPCR)
Mol. Mass.:36197.32
Organism:Homo sapiens (Human)
Description:P0DMS8
Residue:318
BDBM50053924
NameBDBM50053924
Synonyms:3,6-Dichloro-2-(2-isopropoxy-4-methyl-phenyl)-chromen-4-one MRS1067
TypeSmall organic molecule
Emp. Form.C19H16Cl2O3
Mol. Mass.363.235
SMILESCC(C)Oc1cc(C)ccc1-c1oc2ccc(Cl)cc2c(=O)c1Cl