Reaction Details
TargetAdenosine receptor A2a
LigandBDBM50053941
Substrate/Competitorn/a
Meas. Tech.ChEMBL_30928 (CHEMBL647737)
Ki 88.3±n/a nM
Citation Poulsen, SAQuinn, RJ Synthesis and structure-activity relationship of pyrazolo[3,4-d]pyrimidines: potent and selective adenosine A1 receptor antagonists. J Med Chem39:4156-61 (1996) 
 
Adenosine receptor A2a
Name:Adenosine receptor A2a
Type:G Protein-Coupled Receptor (GPCR)
Mol. Mass.:45015.65
Organism:Rattus norvegicus (rat)
Description:Rat A2A receptors expressed in CHO cells.
Residue:410
BDBM50053941
NameBDBM50053941
Synonyms:2-(4-Amino-1-phenyl-1H-pyrazolo[3,4-d]pyrimidin-6-ylsulfanyl)-hexanoic acid amide | CHEMBL133605
TypeSmall organic molecule
Emp. Form.C17H20N6OS
Mol. Mass.356.445
SMILESCCCCC(Sc1nc(N)c2cnn(-c3ccccc3)c2n1)C(N)=O