Reaction Details
TargetD(2) dopamine receptor
LigandBDBM55121
Substrate/Competitorn/a
Meas. Tech.ChEMBL_60222 (CHEMBL672183)
Ki 1.9±n/a nM
Citation Malmberg, AHöök, BBJohansson, AMHacksell, U Novel (R)-2-amino-5-fluorotetralins: dopaminergic antagonists and inverse agonists. J Med Chem39:4421-9 (1996) 
 
D(2) dopamine receptor
Name:D(2) dopamine receptor
Type:Cell-surface receptors
Mol. Mass.:50647.10
Organism:Homo sapiens (Human)
Description:P14416
Residue:443
BDBM55121
NameBDBM55121
Synonyms:3-HYDROXYTYRAMINE HYDROCHLORIDE 4-(2-aminoethyl)pyrocatechol;hydrochloride Dopamine SMR000059081 | cid_65340
TypeSmall organic molecule
Emp. Form.C8H11NO2
Mol. Mass.153.1784
SMILESNCCc1ccc(O)c(O)c1