Reaction Details
TargetAurora kinase A
LigandBDBM50503744
Substrate/Competitorn/a
Meas. Tech.ChEMBL_1812048 (CHEMBL4311508)
IC50 0.060000±n/a nM
Citation Sang, CYQin, WWZhang, XJXu, YMa, YZWang, XRHui, LChen, SW Synthesis and identification of 2,4-bisanilinopyrimidines bearing 2,2,6,6-tetramethylpiperidine-N-oxyl as potential Aurora A inhibitors. Bioorg Med Chem27:65-78 (2019) 
 
Aurora kinase A
Name:Aurora kinase A
Type:Serine/threonine-protein kinase
Mol. Mass.:45830.98
Organism:Homo sapiens (Human)
Description:O14965
Residue:403
BDBM50503744
NameBDBM50503744
Synonyms:CHEMBL4563026
TypeSmall organic molecule
Emp. Form.C33H34ClFN7O3
Mol. Mass.631.12
SMILES[#6]C1([#6])[#6]-[#6](-[#6]C([#6])([#6])[#7]1-[#8;v1])-[#7]-[#6](=O)-c1ccc(-[#7]-c2ncc(F)c(-[#7]-c3ccc(cc3)-[#6](=O)-[#7]-c3ccccc3Cl)n2)cc1