Reaction Details
TargetAurora kinase A
LigandBDBM50503745
Substrate/Competitorn/a
Meas. Tech.ChEMBL_1812048 (CHEMBL4311508)
IC50 0.110000±n/a nM
Citation Sang, CYQin, WWZhang, XJXu, YMa, YZWang, XRHui, LChen, SW Synthesis and identification of 2,4-bisanilinopyrimidines bearing 2,2,6,6-tetramethylpiperidine-N-oxyl as potential Aurora A inhibitors. Bioorg Med Chem27:65-78 (2019) 
 
Aurora kinase A
Name:Aurora kinase A
Type:Serine/threonine-protein kinase
Mol. Mass.:45830.98
Organism:Homo sapiens (Human)
Description:O14965
Residue:403
BDBM50503745
NameBDBM50503745
Synonyms:CHEMBL4460717
TypeSmall organic molecule
Emp. Form.C33H34ClN8O5
Mol. Mass.658.127
SMILES[#6]C1([#6])[#6]-[#6](-[#6]C([#6])([#6])[#7]1-[#8;v1])-[#7]-[#6](=O)-c1ccc(-[#7]-c2ncc(c(-[#7]-c3ccc(cc3)-[#6](=O)-[#7]-c3cccc(Cl)c3)n2)-[#7+](-[#8-])=O)cc1