Reaction Details
TargetAurora kinase A
LigandBDBM50503748
Substrate/Competitorn/a
Meas. Tech.ChEMBL_1812048 (CHEMBL4311508)
IC50 0.140000±n/a nM
Citation Sang, CYQin, WWZhang, XJXu, YMa, YZWang, XRHui, LChen, SW Synthesis and identification of 2,4-bisanilinopyrimidines bearing 2,2,6,6-tetramethylpiperidine-N-oxyl as potential Aurora A inhibitors. Bioorg Med Chem27:65-78 (2019) 
 
Aurora kinase A
Name:Aurora kinase A
Type:Serine/threonine-protein kinase
Mol. Mass.:45830.98
Organism:Homo sapiens (Human)
Description:O14965
Residue:403
BDBM50503748
NameBDBM50503748
Synonyms:CHEMBL4440617
TypeSmall organic molecule
Emp. Form.C26H30N7O5
Mol. Mass.520.5603
SMILES[#6]C1([#6])[#6]-[#6](-[#6]C([#6])([#6])[#7]1-[#8;v1])-[#7]-[#6](=O)-c1ccc(-[#7]-c2ncc(c(-[#7]-c3cccc(-[#8])c3)n2)-[#7+](-[#8-])=O)cc1