Reaction Details
TargetCytochrome P450 1A1
LigandBDBM50503772
Substrate/Competitorn/a
Meas. Tech.ChEMBL_1812126 (CHEMBL4311586)
IC50 14±n/a nM
Citation Kubo, MYamamoto, KItoh, T Design and synthesis of selective CYP1B1 inhibitor via dearomatization of ?-naphthoflavone. Bioorg Med Chem27:285-304 (2019) 
 
Cytochrome P450 1A1
Name:Cytochrome P450 1A1
Type:Protein
Mol. Mass.:58177.23
Organism:Homo sapiens (Human)
Description:P04798
Residue:512
BDBM50503772
NameBDBM50503772
Synonyms:CHEMBL4579760
TypeSmall organic molecule
Emp. Form.C22H20O2
Mol. Mass.316.393
SMILESC=C=C[C@H]1CC[C@@H](CC1)c1cc(=O)c2ccc3ccccc3c2o1