Reaction Details
TargetCytochrome P450 1A1
LigandBDBM50503773
Substrate/Competitorn/a
Meas. Tech.ChEMBL_1812126 (CHEMBL4311586)
IC50 9.5±n/a nM
Citation Kubo, MYamamoto, KItoh, T Design and synthesis of selective CYP1B1 inhibitor via dearomatization of ?-naphthoflavone. Bioorg Med Chem27:285-304 (2019) 
 
Cytochrome P450 1A1
Name:Cytochrome P450 1A1
Type:Protein
Mol. Mass.:58177.23
Organism:Homo sapiens (Human)
Description:P04798
Residue:512
BDBM50503773
NameBDBM50503773
Synonyms:CHEMBL4474660
TypeSmall organic molecule
Emp. Form.C19H11N3O2
Mol. Mass.313.3095
SMILES[N-]=[N+]=Nc1ccc(cc1)-c1cc(=O)c2ccc3ccccc3c2o1