Reaction Details
TargetCarbonic anhydrase 5B, mitochondrial
LigandBDBM50503795
Substrate/Competitorn/a
Meas. Tech.ChEMBL_1812150 (CHEMBL4311610)
Kd 0.012000±n/a nM
Citation Va?kevi?ien?, IPaketuryt?, VPajanok, N?ukauskas, ?Sapijanskait?, BKantminien?, KMickevi?ius, VZubrien?, AMatulis, D Pyrrolidinone-bearing methylated and halogenated benzenesulfonamides as inhibitors of carbonic anhydrases. Bioorg Med Chem27:322-337 (2019) 
 
Carbonic anhydrase 5B, mitochondrial
Name:Carbonic anhydrase 5B, mitochondrial
Type:Enzyme
Mol. Mass.:36440.83
Organism:Homo sapiens (Human)
Description:Human (cloned) isozyme
Residue:317
BDBM50503795
NameBDBM50503795
Synonyms:CHEMBL4463683
TypeSmall organic molecule
Emp. Form.C20H21ClN4O4S
Mol. Mass.448.923
SMILESCc1cc(N2CC(CC2=O)C(=O)N\N=C\c2ccccc2)c(Cl)c(C)c1S(N)(=O)=O