Reaction Details
TargetCarbonic anhydrase 5B, mitochondrial
LigandBDBM50503778
Substrate/Competitorn/a
Meas. Tech.ChEMBL_1812150 (CHEMBL4311610)
Kd 0.051000±n/a nM
Citation Va?kevi?ien?, IPaketuryt?, VPajanok, N?ukauskas, ?Sapijanskait?, BKantminien?, KMickevi?ius, VZubrien?, AMatulis, D Pyrrolidinone-bearing methylated and halogenated benzenesulfonamides as inhibitors of carbonic anhydrases. Bioorg Med Chem27:322-337 (2019) 
 
Carbonic anhydrase 5B, mitochondrial
Name:Carbonic anhydrase 5B, mitochondrial
Type:Enzyme
Mol. Mass.:36440.83
Organism:Homo sapiens (Human)
Description:Human (cloned) isozyme
Residue:317
BDBM50503778
NameBDBM50503778
Synonyms:CHEMBL4443078
TypeSmall organic molecule
Emp. Form.C20H21BrN4O4S
Mol. Mass.493.374
SMILESCc1cc(cc(C)c1S(N)(=O)=O)N1CC(CC1=O)C(=O)N\N=C\c1ccc(Br)cc1