Reaction Details
TargetCarbonic anhydrase 5B, mitochondrial
LigandBDBM50503790
Substrate/Competitorn/a
Meas. Tech.ChEMBL_1812150 (CHEMBL4311610)
Kd 0.089000±n/a nM
Citation Va?kevi?ien?, IPaketuryt?, VPajanok, N?ukauskas, ?Sapijanskait?, BKantminien?, KMickevi?ius, VZubrien?, AMatulis, D Pyrrolidinone-bearing methylated and halogenated benzenesulfonamides as inhibitors of carbonic anhydrases. Bioorg Med Chem27:322-337 (2019) 
 
Carbonic anhydrase 5B, mitochondrial
Name:Carbonic anhydrase 5B, mitochondrial
Type:Enzyme
Mol. Mass.:36440.83
Organism:Homo sapiens (Human)
Description:Human (cloned) isozyme
Residue:317
BDBM50503790
NameBDBM50503790
Synonyms:CHEMBL4458989
TypeSmall organic molecule
Emp. Form.C13H17ClN4O4S
Mol. Mass.360.816
SMILESCc1cc(N2CC(CC2=O)C(=O)NN)c(Cl)c(C)c1S(N)(=O)=O