Reaction Details
TargetCarbonic anhydrase 5B, mitochondrial
LigandBDBM50503780
Substrate/Competitorn/a
Meas. Tech.ChEMBL_1812150 (CHEMBL4311610)
Kd 0.004800±n/a nM
Citation Va?kevi?ien?, IPaketuryt?, VPajanok, N?ukauskas, ?Sapijanskait?, BKantminien?, KMickevi?ius, VZubrien?, AMatulis, D Pyrrolidinone-bearing methylated and halogenated benzenesulfonamides as inhibitors of carbonic anhydrases. Bioorg Med Chem27:322-337 (2019) 
 
Carbonic anhydrase 5B, mitochondrial
Name:Carbonic anhydrase 5B, mitochondrial
Type:Enzyme
Mol. Mass.:36440.83
Organism:Homo sapiens (Human)
Description:Human (cloned) isozyme
Residue:317
BDBM50503780
NameBDBM50503780
Synonyms:CHEMBL4475315
TypeSmall organic molecule
Emp. Form.C20H20BrClN4O4S
Mol. Mass.527.819
SMILESCc1cc(N2CC(CC2=O)C(=O)N\N=C\c2ccc(Br)cc2)c(Cl)c(C)c1S(N)(=O)=O