Reaction Details
TargetGag-Pol polyprotein [489-587]
LigandBDBM50054610
Substrate/Competitorn/a
Meas. Tech.ChEMBL_157706 (CHEMBL763380)
Ki 16±n/a nM
Citation Thaisrivongs, SRomero, DLTommasi, RAJanakiraman, MNStrohbach, JWTurner, SRBiles, CMorge, RRJohnson, PDAristoff, PATomich, PKLynn, JCHorng, MMChong, KTHinshaw, RRHowe, WJFinzel, BCWatenpaugh, KD Structure-based design of HIV protease inhibitors: 5,6-dihydro-4-hydroxy-2-pyrones as effective, nonpeptidic inhibitors. J Med Chem39:4630-42 (1996) 
 
Gag-Pol polyprotein [489-587]
Name:Gag-Pol polyprotein [489-587]
Type:Enzyme Subunit
Mol. Mass.:10781.16
Organism:Human immunodeficiency virus type 1
Description:P04585[489-587]
Residue:99
BDBM50054610
NameBDBM50054610
Synonyms:4-Hydroxy-6-phenethyl-3-(1-phenyl-allyl)-6-propyl-5,6-dihydro-pyran-2-one | CHEMBL143385
TypeSmall organic molecule
Emp. Form.C25H28O3
Mol. Mass.376.488
SMILESCCCC1(CCc2ccccc2)CC(=O)C(C(C=C)c2ccccc2)C(=O)O1